Target
Sodium/bile acid cotransporter
Ligand
BDBM400155
Substrate
Meas. Tech.
HBV DNA Quantification Assay
EC50
12.2±n/a nM
Citation
 Du, JKaplan, JAKirschberg, TAKobayashi, TLazerwith, SELee, RAMedley, JWMitchell, MLMorganelli, PAPyun, HShevick, SLSquires, NHWatkins, WJ Substituted pyrrolizine compounds and uses thereof US Patent  US10328053 Publication Date 6/25/2019 
Target
Name:
Sodium/bile acid cotransporter
Synonyms:
Bile acid transporter NTCP_HUMAN | SLC10A1
Type:
PROTEIN
Mol. Mass.:
38131.81
Organism:
Homo sapiens (Human)
Description:
ChEMBL_838517
Residue:
349
  
Inhibitor
Name:
BDBM400155
Synonyms:
7-(2-((1-carbamoyl-3,3-difluorocyclobutyl)amino)-2-oxoacetyl)-6-methyl-N-(3,4,5-trifluorophenyl)-2,3-dihydro-1H-pyrrolizine-5-carboxamide US10874640, Compound 140 | US20230270719, Compound 140
Type:
Small organic molecule
Emp. Form.:
C22H19F5N4O4
Mol. Mass.:
498.4027
SMILES:
Cc1c(C(=O)C(=O)NC2(CC(F)(F)C2)C(N)=O)c2CCCn2c1C(=O)Nc1cc(F)c(F)c(F)c1
: