Target
Metabotropic glutamate receptor 5
Ligand
BDBM400166
Substrate
Meas. Tech.
Functional Calcium Flux Assay
IC50
<500±n/a nM
Citation
 Chen, LDuan, YShe, JWu, C Substituted pyrrolidines as mGluR5 antagonists US Patent  US10328054 Publication Date 6/25/2019 
Target
Name:
Metabotropic glutamate receptor 5
Synonyms:
GRM5_RAT Grm5 Mglur5 metabotropic glutamate 5/1-C metabotropic glutamate 5a
Type:
Enzyme
Mol. Mass.:
131900.14
Organism:
Rattus norvegicus (Rat)
Description:
P31424
Residue:
1203
  
Inhibitor
Name:
BDBM400166
Synonyms:
US10328054, Example Compound 17
Type:
Small organic molecule
Emp. Form.:
C18H15ClN2
Mol. Mass.:
294.778
SMILES:
Clc1ccccc1N1CC2CC2(C1)C#Cc1ccccn1
: