Target
Lysine-specific histone demethylase 1A
Ligand
BDBM283278
Substrate
Meas. Tech.
In Vitro Enzyme Inhibition Assay-LSD-1
IC50
<100±n/a nM
Citation
 Xu, JCho, RNguyen, A Treatment of relapsed and/or refractory solid tumors and non-hodgkin's lymphomas US Patent  US10328077 Publication Date 6/25/2019 
Target
Name:
Lysine-specific histone demethylase 1A
Synonyms:
AOF2 Flavin-containing amine oxidase domain-containing protein 2 KDM1A KIAA0601 Lysine-specific demethylase 1 (LSD1) Lysine-specific histone demethylase 1 (LSD1)
Type:
Enzyme
Mol. Mass.:
92901.01
Organism:
Homo sapiens (Human)
Description:
O60341
Residue:
852
  
Inhibitor
Name:
BDBM283278
Synonyms:
4-[2-[1,4]diazepan-1-yl-5-(6- methoxy-pyridin-3-yl)-1-methyl- 6-oxo-1,6-dihydro-pyrimidin-4- yl]-2-fluoro benzonitrile US10207999, Example 61 US10548896, Example 61 US10960005, Example 61 US9573930, Example 61 US9776974, Example 61
Type:
Small organic molecule
Emp. Form.:
C23H23FN6O2
Mol. Mass.:
434.4661
SMILES:
COc1ccc(cn1)-c1c(nc(N2CCCNCC2)n(C)c1=O)-c1ccc(C#N)c(F)c1
: