Target
Lysine-specific histone demethylase 1A
Ligand
BDBM283301
Substrate
Meas. Tech.
In Vitro Enzyme Inhibition Assay-LSD-1
IC50
<100±n/a nM
Citation
 Xu, JCho, RNguyen, A Treatment of relapsed and/or refractory solid tumors and non-hodgkin's lymphomas US Patent  US10328077 Publication Date 6/25/2019 
Target
Name:
Lysine-specific histone demethylase 1A
Synonyms:
AOF2 Flavin-containing amine oxidase domain-containing protein 2 KDM1A KIAA0601 Lysine-specific demethylase 1 (LSD1) Lysine-specific histone demethylase 1 (LSD1)
Type:
Enzyme
Mol. Mass.:
92901.01
Organism:
Homo sapiens (Human)
Description:
O60341
Residue:
852
  
Inhibitor
Name:
BDBM283301
Synonyms:
4-[2-(4-dimethylamino-piperidin-1- yl)-1-methyl-5-(6-methyl-pyridin- 3-yl)-6-oxo-1,6-dihydro-pyrimidin- 4-yl]-2-fluoro-benzonitrile US10207999, Example 82 US10548896, Example 82 US10960005, Example 82 US9573930, Example 82 US9776974, Example 82
Type:
Small organic molecule
Emp. Form.:
C25H27FN6O
Mol. Mass.:
446.5199
SMILES:
CN(C)C1CCN(CC1)c1nc(-c2ccc(C#N)c(F)c2)c(-c2ccc(C)nc2)c(=O)n1C
: