Target
Lysine-specific histone demethylase 1A
Ligand
BDBM289959
Substrate
Meas. Tech.
In Vitro Enzyme Inhibition Assay-LSD-1
IC50
<100±n/a nM
Citation
 Xu, JCho, RNguyen, A Treatment of relapsed and/or refractory solid tumors and non-hodgkin's lymphomas US Patent  US10328077 Publication Date 6/25/2019 
Target
Name:
Lysine-specific histone demethylase 1A
Synonyms:
AOF2 Flavin-containing amine oxidase domain-containing protein 2 KDM1A KIAA0601 Lysine-specific demethylase 1 (LSD1) Lysine-specific histone demethylase 1 (LSD1)
Type:
Enzyme
Mol. Mass.:
92901.01
Organism:
Homo sapiens (Human)
Description:
O60341
Residue:
852
  
Inhibitor
Name:
BDBM289959
Synonyms:
4-[2-(4-aminopiperidin- 1-yl)-5-(3-fluorophenyl)- 1-methyl-6-oxopyrimidin- 4-yl]-2-fluorobenzonitrile US10328077, Example 102 US10849898, Example 102 US11084793, Example 102 US9771329, Example 102 | US9776974, Example 102
Type:
Small organic molecule
Emp. Form.:
C23H21F2N5O
Mol. Mass.:
421.4425
SMILES:
Cn1c(nc(-c2ccc(C#N)c(F)c2)c(-c2cccc(F)c2)c1=O)N1CCC(N)CC1
: