Target
Amine oxidase [flavin-containing] B
Ligand
BDBM256458
Substrate
Meas. Tech.
Monoamine Oxidase Assays for Determining the Selectivity of the Compounds of the Invention for LSD1
Ki
>100000±n/a nM
Citation
 Ortega Muñoz, AFyfe, MCMartinell Pedemonte, MEstiarte Martinez, MValls Vidal, NKurz, GCastro Palomino Laria, JC (Hetero)aryl cyclopropylamine compounds as LSD1 inhibitors US Patent  US10329256 Publication Date 6/25/2019 
Target
Name:
Amine oxidase [flavin-containing] B
Synonyms:
AOFB_HUMAN MAOB Monoamine oxidase type B (MAO B) Monoamine oxidase type B (MAOB)
Type:
Protein
Mol. Mass.:
58768.76
Organism:
Homo sapiens (Human)
Description:
P27338
Residue:
520
  
Inhibitor
Name:
BDBM256458
Synonyms:
US10329256, Example 2 US9944601, Example 2
Type:
Small organic molecule
Emp. Form.:
C14H20N2
Mol. Mass.:
216.322
SMILES:
C1[C@H](NC2CCNCC2)[C@H]1c1ccccc1
: