Target
Amine oxidase [flavin-containing] A
Ligand
BDBM256461
Substrate
Meas. Tech.
Monoamine Oxidase Assays for Determining the Selectivity of the Compounds of the Invention for LSD1
IC50
38320±n/a nM
Citation
 Ortega Muñoz, AFyfe, MCMartinell Pedemonte, MEstiarte Martinez, MValls Vidal, NKurz, GCastro Palomino Laria, JC (Hetero)aryl cyclopropylamine compounds as LSD1 inhibitors US Patent  US10329256 Publication Date 6/25/2019 
Target
Name:
Amine oxidase [flavin-containing] A
Synonyms:
AOFA_HUMAN MAO-A Monoamine oxidase Monoamine oxidase type A (MAO A) Monoamine oxidase type A (MAOA)
Type:
Protein
Mol. Mass.:
59689.53
Organism:
Homo sapiens (Human)
Description:
P21397
Residue:
527
  
Inhibitor
Name:
BDBM256461
Synonyms:
US10329256, Example 6 US9944601, Example 6
Type:
Small organic molecule
Emp. Form.:
C16H24N2
Mol. Mass.:
244.3752
SMILES:
C(CC1CCNCC1)N[C@H]1C[C@@H]1c1ccccc1
: