Target
Lysine-specific histone demethylase 1A
Ligand
BDBM256475
Substrate
Meas. Tech.
Inhibition of LSD1
IC50
38.0±n/a nM
Citation
 Ortega Muñoz, AFyfe, MCMartinell Pedemonte, MEstiarte Martinez, MValls Vidal, NKurz, GCastro Palomino Laria, JC (Hetero)aryl cyclopropylamine compounds as LSD1 inhibitors US Patent  US10329256 Publication Date 6/25/2019 
Target
Name:
Lysine-specific histone demethylase 1A
Synonyms:
AOF2 Flavin-containing amine oxidase domain-containing protein 2 KDM1A KIAA0601 Lysine-specific demethylase 1 (LSD1) Lysine-specific histone demethylase 1 (LSD1)
Type:
Enzyme
Mol. Mass.:
92901.01
Organism:
Homo sapiens (Human)
Description:
O60341
Residue:
852
  
Inhibitor
Name:
BDBM256475
Synonyms:
US10329256, Example 20 US9944601, Example 20
Type:
Small organic molecule
Emp. Form.:
C14H19FN2
Mol. Mass.:
234.3125
SMILES:
Fc1ccccc1C1CC1NC1CCNCC1
: