Target
Lysine-specific histone demethylase 1A
Ligand
BDBM256493
Substrate
Meas. Tech.
Inhibition of LSD1
IC50
108±n/a nM
Citation
 Ortega Muñoz, AFyfe, MCMartinell Pedemonte, MEstiarte Martinez, MValls Vidal, NKurz, GCastro Palomino Laria, JC (Hetero)aryl cyclopropylamine compounds as LSD1 inhibitors US Patent  US10329256 Publication Date 6/25/2019 
Target
Name:
Lysine-specific histone demethylase 1A
Synonyms:
AOF2 Flavin-containing amine oxidase domain-containing protein 2 KDM1A KIAA0601 Lysine-specific demethylase 1 (LSD1) Lysine-specific histone demethylase 1 (LSD1)
Type:
Enzyme
Mol. Mass.:
92901.01
Organism:
Homo sapiens (Human)
Description:
O60341
Residue:
852
  
Inhibitor
Name:
BDBM256493
Synonyms:
US10329256, Example 38 US9944601, Example 38
Type:
Small organic molecule
Emp. Form.:
C17H26N2
Mol. Mass.:
258.4017
SMILES:
CC(C)N1CCC(CC1)N[C@H]1C[C@@H]1c1ccccc1
: