Target
Ribonuclease H1
Ligand
BDBM33419
Substrate
RNA/DNA hybrid
Meas. Tech.
Fluorescence-Based RNase H Assay
pH
8±n/a
Temperature
293.15±n/a K
IC50
48500±n/a nM
Comments
IC50 is the mean of 48 and 49 uM.
Citation
 Kirschberg, TABalakrishnan, MSquires, NHBarnes, TBrendza, KMChen, XEisenberg, EJJin, WKutty, NLeavitt, SLiclican, ALiu, QLiu, XMak, JPerry, JKWang, MWatkins, WJLansdon, EB RNase H active site inhibitors of human immunodeficiency virus type 1 reverse transcriptase: design, biochemical activity, and structural information. J Med Chem 52:5781-4 (2009)  
Target
Name:
Ribonuclease H1
Synonyms:
RNASEH1 RNH1_HUMAN Ribonuclease H type II
Type:
Enzyme
Mol. Mass.:
32076.45
Organism:
Homo sapiens (Human)
Description:
Residue:
286
  
Inhibitor
Name:
BDBM33419
Synonyms:
pyrimidinol carboxylic acid, 11
Type:
Small organic molecule
Emp. Form.:
C14H8BrClN2O4S
Mol. Mass.:
415.646
SMILES:
OC(=O)c1nc(Cc2c(Br)sc3ccc(Cl)cc23)[nH]c(=O)c1O
:
Substrate
Name:
RNA/DNA hybrid
Synonyms:
Type:
fluorescein-labeled RNA annealed to DNA
Mol. Mass.:
2134.40
Organism:
Description:
It is a 18-nucleotide 3-fluorescein-labeled RNA annealed to a complementary 18-nucleotide 5-Dabcyl-modified DNA.
Residue:
23