Target
Coagulation factor XII
Ligand
BDBM33422
Substrate
Boc-Gln-Gly-Arg-AMC
Meas. Tech.
Factor XIIa Dose Response Confirmation from Single Well HTS
pH
7.4±n/a
Temperature
296.15±n/a K
IC50
>50000±n/a nM
Citation
 PubChem, PC Factor XIIa Dose Response Confirmation from Single Well HTS PubChem Bioassay (2007)[AID] 
Target
Name:
Coagulation factor XII
Synonyms:
Beta-factor XIIa part 1 Carboxylesterase 2 (intestine, liver) Coagulation factor XII (FXII) Coagulation factor XIIa light chain FA12_HUMAN Factor XIIa (fXIIa) Hageman factor
Type:
Enzyme
Mol. Mass.:
67810.07
Organism:
Homo sapiens (Human)
Description:
P00748
Residue:
615
  
Inhibitor
Name:
BDBM33422
Synonyms:
1-(2-phenylethyl)-N-(2-pyridinylmethyl)-4-triazolecarboxamide 1-(2-phenylethyl)-N-(pyridin-2-ylmethyl)triazole-4-carboxamide 1-phenethyl-N-(2-pyridylmethyl)triazole-4-carboxamide SMR000000643 | cid_644529
Type:
Small organic molecule
Emp. Form.:
C17H17N5O
Mol. Mass.:
307.3498
SMILES:
O=C(NCc1ccccn1)c1cn(CCc2ccccc2)nn1
:
Substrate
Name:
Boc-Gln-Gly-Arg-AMC
Synonyms:
Type:
fluorescent substrate
Mol. Mass.:
358.43
Organism:
Description:
Residue:
3
NA