Target
Coagulation factor XII
Ligand
BDBM32672
Substrate
Boc-Gln-Gly-Arg-AMC
Meas. Tech.
Factor XIIa Dose Response Confirmation from Single Well HTS
pH
7.4±n/a
Temperature
296.15±n/a K
IC50
7103.7±n/a nM
Citation
 PubChem, PC Factor XIIa Dose Response Confirmation from Single Well HTS PubChem Bioassay (2007)[AID] 
Target
Name:
Coagulation factor XII
Synonyms:
Beta-factor XIIa part 1 Carboxylesterase 2 (intestine, liver) Coagulation factor XII (FXII) Coagulation factor XIIa light chain FA12_HUMAN Factor XIIa (fXIIa) Hageman factor
Type:
Enzyme
Mol. Mass.:
67810.07
Organism:
Homo sapiens (Human)
Description:
P00748
Residue:
615
  
Inhibitor
Name:
BDBM32672
Synonyms:
MLS000097371 N-[4-(benzotriazol-1-ylcarbonyl)phenyl]butanamide N-[4-(benzotriazole-1-carbonyl)phenyl]butyramide SMR000076008 | cid_2201551
Type:
Small organic molecule
Emp. Form.:
C17H16N4O2
Mol. Mass.:
308.3345
SMILES:
CCCC(=O)Nc1ccc(cc1)C(=O)n1nnc2ccccc12
:
Substrate
Name:
Boc-Gln-Gly-Arg-AMC
Synonyms:
Type:
fluorescent substrate
Mol. Mass.:
358.43
Organism:
Description:
Residue:
3
NA