Target
Coagulation factor XII
Ligand
BDBM32674
Substrate
Boc-Gln-Gly-Arg-AMC
Meas. Tech.
Factor XIIa Dose Response Confirmation from Single Well HTS
pH
7.4±n/a
Temperature
296.15±n/a K
IC50
973.456667±n/a nM
Citation
 PubChem, PC Factor XIIa Dose Response Confirmation from Single Well HTS PubChem Bioassay (2007)[AID] 
Target
Name:
Coagulation factor XII
Synonyms:
Beta-factor XIIa part 1 Carboxylesterase 2 (intestine, liver) Coagulation factor XII (FXII) Coagulation factor XIIa light chain FA12_HUMAN Factor XIIa (fXIIa) Hageman factor
Type:
Enzyme
Mol. Mass.:
67810.07
Organism:
Homo sapiens (Human)
Description:
P00748
Residue:
615
  
Inhibitor
Name:
BDBM32674
Synonyms:
1-benzotriazolyl-(1-phenyl-3-pyridin-4-yl-4-pyrazolyl)methanone MLS000049336 benzotriazol-1-yl-(1-phenyl-3-pyridin-4-yl-pyrazol-4-yl)methanone benzotriazol-1-yl-[1-phenyl-3-(4-pyridyl)pyrazol-4-yl]methanone | cid_1307930
Type:
Small organic molecule
Emp. Form.:
C21H14N6O
Mol. Mass.:
366.3755
SMILES:
O=C(c1cn(nc1-c1ccncc1)-c1ccccc1)n1nnc2ccccc12
:
Substrate
Name:
Boc-Gln-Gly-Arg-AMC
Synonyms:
Type:
fluorescent substrate
Mol. Mass.:
358.43
Organism:
Description:
Residue:
3
NA