Target
Prothrombin
Ligand
BDBM33723
Substrate
Boc-Val-Pro-Arg-AMC
Meas. Tech.
Thrombin 1536 HTS Dose Response Confirmation
pH
7.5±n/a
Temperature
296.15±n/a K
IC50
29.31±n/a nM
Citation
 PubChem, PC Thrombin 1536 HTS Dose Response Confirmation PubChem Bioassay (2008)[AID] 
Target
Name:
Prothrombin
Synonyms:
Activation peptide fragment 1 Coagulation factor II Prothrombin precursor Thrombin heavy chain | Thrombin light chain
Type:
Protein
Mol. Mass.:
70029.57
Organism:
Homo sapiens (Human)
Description:
P00734
Residue:
622
  
Inhibitor
Name:
BDBM33723
Synonyms:
(4-nitrophenyl)-[3-phenyl-5-[(phenylmethyl)amino]-1,2,4-triazol-1-yl]methanone N-benzyl-1-(4-nitrobenzoyl)-3-phenyl-1H-1,2,4-triazol-5-amine [5-(benzylamino)-3-phenyl-1,2,4-triazol-1-yl]-(4-nitrophenyl)methanone | cid_1295977
Type:
Small organic molecule
Emp. Form.:
C22H17N5O3
Mol. Mass.:
399.4021
SMILES:
[O-][N+](=O)c1ccc(cc1)C(=O)n1nc(nc1NCc1ccccc1)-c1ccccc1
:
Substrate
Name:
Boc-Val-Pro-Arg-AMC
Synonyms:
Type:
fluorogenic substrate
Mol. Mass.:
358.43
Organism:
Description:
Residue:
3
NA