Target
Gag-Pol polyprotein [600-1028,C879S]/[600-1151,C879S]
Ligand
BDBM33957
Substrate
poly(rA)-oligo(dT)(12-18)
Meas. Tech.
Assay of RT RNA-Dependent DNA Polymerase (RDDP) Activity
pH
7.8±n/a
Temperature
310.15±n/a K
IC50
>50000±n/a nM
Citation
 Himmel, DMSarafianos, SGDharmasena, SHossain, MMMcCoy-Simandle, KIlina, TClark, ADKnight, JLJulias, JGClark, PKKrogh-Jespersen, KLevy, RMHughes, SHParniak, MAArnold, E HIV-1 reverse transcriptase structure with RNase H inhibitor dihydroxy benzoyl naphthyl hydrazone bound at a novel site. ACS Chem Biol 1:702-12 (2006)  
Target
Name:
Gag-Pol polyprotein [600-1028,C879S]/[600-1151,C879S]
Synonyms:
HIV-1 Reverse Transcriptase RNase H
Type:
Protein Complex
Mol. Mass.:
Description:
Components:
This complex has 2 components.
Component 1
Name:
Gag-Pol polyprotein [600-1151,C879S]
Synonyms:
HIV-1 Reverse Transcriptase RNase H Chain A gag-pol
Type:
Enzyme Subunit
Mol. Mass.:
63584.38
Organism:
Human immunodeficiency virus type 1
Description:
P03366[600-1151,C879S]
Residue:
552
  
Component 2
Name:
Gag-Pol polyprotein [600-1028,C879S]
Synonyms:
HIV-1 Reverse Transcriptase RNase H Chain B gag-pol
Type:
Enzyme Subunit
Mol. Mass.:
50093.74
Organism:
Human immunodeficiency virus type 1
Description:
P03366[600-1028,C879S]
Residue:
429
  
Inhibitor
Name:
BDBM33957
Synonyms:
dihydroxy benzoyl naphthyl hydrazone (DHBNH) analogue, 4
Type:
Small organic molecule
Emp. Form.:
C21H21N3O2
Mol. Mass.:
347.4103
SMILES:
COc1ccc2ccccc2c1\C=N\NC(=O)c1ccc(cc1)N(C)C
:
Substrate
Name:
poly(rA)-oligo(dT)(12-18)
Synonyms:
homopolymeric template-primer
Type:
RNA/DNA Duplex
Mol. Mass.:
358.43
Organism:
Description:
[3H]-TTP as co-substrate.
Residue:
3
NA