Target
Alpha-1,6-mannosyl-glycoprotein 2-beta-N-acetylglucosaminyltransferase
Ligand
BDBM400246
Substrate
Meas. Tech.
MGAT LCMS Assay
IC50
5.00±n/a nM
Citation
 Ahmad, S Tetrazolone-substituted dihydropyridinone MGAT2 inhibitors US Patent  US10329273 Publication Date 6/25/2019 
Target
Name:
Alpha-1,6-mannosyl-glycoprotein 2-beta-N-acetylglucosaminyltransferase
Synonyms:
2.4.1.143 GNT-II MGAT2 Mannoside acetylglucosaminyltransferase 2 Monoacylglycerol acyltransferase type 2 (h-MGAT2) h-MGAT2 (human monoacylglycerol acyltransferase type 2)
Type:
Mol. Mass.:
51567.80
Organism:
Homo sapiens (Human)
Description:
Q10469
Residue:
447
  
Inhibitor
Name:
BDBM400246
Synonyms:
US10329273, Example 17 | US11479538, Example 17
Type:
Small organic molecule
Emp. Form.:
C27H29F6N7O2
Mol. Mass.:
597.5553
SMILES:
FC(F)(F)CCCCCCn1cc(cn1)[C@@]1(CC(=C(C(=O)N1)n1nn[nH]c1=O)c1ccc2CCCCc2c1)C(F)(F)F
: