Target
Protein kinase C alpha type
Ligand
BDBM33969
Substrate
Peptide Substrate
Meas. Tech.
Protein Kinase Assays
pH
7.4±n/a
Temperature
296.15±n/a K
IC50
7.1±2 nM
Citation
 Wagner, Jvon Matt, PSedrani, RAlbert, RCooke, NEhrhardt, CGeiser, MRummel, GStark, WStrauss, ACowan-Jacob, SWBeerli, CWeckbecker, GEvenou, JPZenke, GCottens, S Discovery of 3-(1H-indol-3-yl)-4-[2-(4-methylpiperazin-1-yl)quinazolin-4-yl]pyrrole-2,5-dione (AEB071), a potent and selective inhibitor of protein kinase C isotypes. J Med Chem 52:6193-6 (2009)  
Target
Name:
Protein kinase C alpha type
Synonyms:
KPCA_HUMAN PKC alpha and beta-2 PKC-alpha PRKACA Protein Kinase C- alpha Protein kinase C alpha (PKCa) Protein kinase C alpha type (PRKCA) RAF proto-oncogene serine/threonine-protein kinase
Type:
Enzyme
Mol. Mass.:
76755.65
Organism:
Homo sapiens (Human)
Description:
The recombinant human PKC enzymes were produced using a baculovirus expression system in SF9 cells
Residue:
672
  
Inhibitor
Name:
BDBM33969
Synonyms:
maleimide derivative, 11
Type:
Small organic molecule
Emp. Form.:
C23H22N4O2
Mol. Mass.:
386.4464
SMILES:
CN1CCN(CC1)c1cccc(c1)C1=C(C(=O)NC1=O)c1c[nH]c2ccccc12
:
Substrate
Name:
Peptide Substrate
Synonyms:
biotinylated tridecapeptide substrate
Type:
Peptide
Mol. Mass.:
1564.86
Organism:
Description:
Residue:
13
RFARKGSLRQKNV