Target
Protein kinase C epsilon type
Ligand
BDBM33966
Substrate
Peptide Substrate
Meas. Tech.
Protein Kinase Assays
Temperature
298.15±n/a K
IC50
285±n/a nM
Comments
extracted
Citation
 Wagner, Jvon Matt, PSedrani, RAlbert, RCooke, NEhrhardt, CGeiser, MRummel, GStark, WStrauss, ACowan-Jacob, SWBeerli, CWeckbecker, GEvenou, JPZenke, GCottens, S Discovery of 3-(1H-indol-3-yl)-4-[2-(4-methylpiperazin-1-yl)quinazolin-4-yl]pyrrole-2,5-dione (AEB071), a potent and selective inhibitor of protein kinase C isotypes. J Med Chem 52:6193-6 (2009)  
Target
Name:
Protein kinase C epsilon type
Synonyms:
KPCE_HUMAN PKCE Protein kinase C epsilon Protein kinase C, PKC; classical/novel nPKC-epsilon
Type:
Enzyme
Mol. Mass.:
83680.45
Organism:
Homo sapiens (Human)
Description:
The recombinant human PKC enzymes were produced using a baculovirus expression system in SF9 cells
Residue:
737
  
Inhibitor
Name:
BDBM33966
Synonyms:
maleimide derivative, 5
Type:
Small organic molecule
Emp. Form.:
C25H23N3O2S
Mol. Mass.:
429.534
SMILES:
CN(C)CCCn1cc(C2=C(C(=O)NC2=O)c2csc3ccccc23)c2ccccc12
:
Substrate
Name:
Peptide Substrate
Synonyms:
biotinylated tridecapeptide substrate
Type:
Peptide
Mol. Mass.:
1564.86
Organism:
Description:
Residue:
13
RFARKGSLRQKNV