Target
Protein kinase C eta type
Ligand
BDBM33968
Substrate
Peptide Substrate
Meas. Tech.
Protein Kinase Assays
Temperature
298.15±n/a K
IC50
11±n/a nM
Comments
extracted
Citation
 Wagner, Jvon Matt, PSedrani, RAlbert, RCooke, NEhrhardt, CGeiser, MRummel, GStark, WStrauss, ACowan-Jacob, SWBeerli, CWeckbecker, GEvenou, JPZenke, GCottens, S Discovery of 3-(1H-indol-3-yl)-4-[2-(4-methylpiperazin-1-yl)quinazolin-4-yl]pyrrole-2,5-dione (AEB071), a potent and selective inhibitor of protein kinase C isotypes. J Med Chem 52:6193-6 (2009)  
Target
Name:
Protein kinase C eta type
Synonyms:
KPCL_HUMAN PKCL PRKCL Protein kinase C, PKC; classical/novel | nPKC-eta
Type:
Enzyme
Mol. Mass.:
77844.26
Organism:
Homo sapiens (Human)
Description:
The recombinant human PKC enzymes were produced using a baculovirus expression system in SF9 cells
Residue:
683
  
Inhibitor
Name:
BDBM33968
Synonyms:
maleimide derivative, 10
Type:
Small organic molecule
Emp. Form.:
C26H23N3O3
Mol. Mass.:
425.4791
SMILES:
CN(C)CCOc1cc(C2=C(C(=O)NC2=O)c2c[nH]c3ccccc23)c2ccccc2c1
:
Substrate
Name:
Peptide Substrate
Synonyms:
biotinylated tridecapeptide substrate
Type:
Peptide
Mol. Mass.:
1564.86
Organism:
Description:
Residue:
13
RFARKGSLRQKNV