Target
Cathepsin S
Ligand
BDBM33995
Substrate
Cathepsin S Substrate Peptide
Meas. Tech.
Cathepsn S Inhibition Assay
pH
5±n/a
Temperature
296.15±n/a K
IC50
330±n/a nM
Citation
 Ameriks, MKAxe, FUBembenek, SDEdwards, JPGu, YKarlsson, LRandal, MSun, SThurmond, RLZhu, J Pyrazole-based cathepsin S inhibitors with arylalkynes as P1 binding elements. Bioorg Med Chem Lett 19:6131-4 (2009)  
Target
Name:
Cathepsin S
Synonyms:
CATS_HUMAN Cathepsin S (Cat S) | cathepsin S preproprotein
Type:
Protein
Mol. Mass.:
37507.38
Organism:
Homo sapiens (Human)
Description:
P25774
Residue:
331
  
Inhibitor
Name:
BDBM33995
Synonyms:
arylalkyne pyrazole-based compound, 29
Type:
Small organic molecule
Emp. Form.:
C32H30Cl2N4O3
Mol. Mass.:
589.512
SMILES:
Clc1ccc(cc1)C#Cc1cc(ccc1Cl)-c1nn(CCCN2CCOCC2)c2CCN(Cc12)C(=O)c1ccco1
:
Substrate
Name:
Cathepsin S Substrate Peptide
Synonyms:
Type:
Internally quenched FRET peptide
Mol. Mass.:
2951.18
Organism:
Description:
Residue:
27