Target
Peroxisome proliferator-activated receptor gamma
Ligand
BDBM33296
Substrate
BDBM33297
Meas. Tech.
Scintillation Proximity Assay (IC50) and PPAR gamma Transactivation Assay (EC50)
pH
7.4±n/a
Temperature
296.15±n/a K
IC50
4000±n/a nM
EC50
3900±n/a nM
Comments
Efficacy=57% (The maximum efficacy of darglitazone was defined as 100%)
Citation
 Casimiro-Garcia, ABigge, CFDavis, JAPadalino, TPulaski, JOhren, JFMcConnell, PKane, CDRoyer, LJStevens, KAAuerbach, BJCollard, WTMcGregor, CFakhoury, SASchaum, RPZhou, H Effects of modifications of the linker in a series of phenylpropanoic acid derivatives: Synthesis, evaluation as PPARalpha/gamma dual agonists, and X-ray crystallographic studies. Bioorg Med Chem 16:4883-907 (2008)  
Target
Name:
Peroxisome proliferator-activated receptor gamma
Synonyms:
NR1C3 PPAR-gamma PPARG_HUMAN Peroxisome proliferator-activated receptor gamma (PPAR gamma) Peroxisome proliferator-activated receptor gamma (PPARĪ³) peroxisome proliferator-activated receptor gamma isoform 2
Type:
Nuclear Receptor
Mol. Mass.:
57613.46
Organism:
Homo sapiens (Human)
Description:
P37231
Residue:
505
  
Inhibitor
Name:
BDBM33296
Synonyms:
BMC164883 Compound 58 racemic
Type:
Small organic molecule
Emp. Form.:
C28H27NO3
Mol. Mass.:
425.5189
SMILES:
Cc1oc(nc1CCCc1ccc(CC(C(O)=O)c2ccccc2)cc1)-c1ccccc1
:
Substrate
Name:
BDBM33297
Synonyms:
[3H]Darglitazone
Type:
radiolabeled ligand
Emp. Form.:
C23H20N2O4S
Mol. Mass.:
420.481
SMILES:
Cc1oc(nc1CCC(=O)c1ccc(CC2SC(=O)NC2=O)cc1)-c1ccccc1
: