Target
Tyrosine-protein kinase JAK2 [828-1132]
Ligand
BDBM400473
Substrate
Meas. Tech.
In Vitro JAK Kinase Assay
IC50
<5±n/a nM
Citation
 Huang, TXue, C Piperidin-4-yl azetidine derivatives as JAK1 inhibitors US Patent  US9999619 Publication Date 6/19/2018 
Target
Name:
Tyrosine-protein kinase JAK2 [828-1132]
Synonyms:
JAK2 JAK2_HUMAN | Tyrosine-protein kinase JAK2
Type:
Mol. Mass.:
35579.28
Organism:
Homo sapiens (Human)
Description:
O60674[828-1132]
Residue:
305
  
Inhibitor
Name:
BDBM400473
Synonyms:
US10695337, Example 228 US9999619, Example 228
Type:
Small organic molecule
Emp. Form.:
C26H25ClF2N8
Mol. Mass.:
522.98
SMILES:
Fc1ccc(Cl)c(F)c1CN1CCC(CC1)N1CC(CC#N)(C1)n1cc(cn1)-c1ncnc2[nH]ccc12
: