Target
Casein kinase II subunit alpha
Ligand
BDBM34050
Substrate
CK-2 Peptide Substrate
Meas. Tech.
CK2 Phosphorylation Assay
pH
7.5±n/a
Temperature
310.15±n/a K
Ki
90±n/a nM
Citation
 Gianoncelli, ACozza, GOrzeszko, AMeggio, FKazimierczuk, ZPinna, LA Tetraiodobenzimidazoles are potent inhibitors of protein kinase CK2. Bioorg Med Chem 17:7281-9 (2009)  
Target
Name:
Casein kinase II subunit alpha
Synonyms:
CSK21_RAT Csnk2a1
Type:
Enzyme Subunit
Mol. Mass.:
45081.00
Organism:
Rattus norvegicus (Rat)
Description:
Native CK2 purified from rat liver was used in enzyme phosphorylation assay.
Residue:
391
  
Inhibitor
Name:
BDBM34050
Synonyms:
iodinated benzimidazole, 13a
Type:
Small organic molecule
Emp. Form.:
C7HBrI4N2
Mol. Mass.:
700.618
SMILES:
Brc1nc2c(I)c(I)c(I)c(I)c2[nH]1
:
Substrate
Name:
CK-2 Peptide Substrate
Synonyms:
Type:
Peptide
Mol. Mass.:
1446.31
Organism:
Description:
Residue:
12
RRRADDSDDDDD