Target
Glycogen phosphorylase, muscle form
Ligand
BDBM34090
Substrate
BDBM23188
Meas. Tech.
Glycogen Phosphorylase Enzyme Assay
pH
7.2±n/a
Temperature
295.15±n/a K
IC50
25900±n/a nM
Citation
 Zhang, LLi, HZhu, QLiu, JChen, LLeng, YJiang, HLiu, H Benzamide derivatives as dual-action hypoglycemic agents that inhibit glycogen phosphorylase and activate glucokinase. Bioorg Med Chem 17:7301-12 (2009)  
Target
Name:
Glycogen phosphorylase, muscle form
Synonyms:
Glycogen Phosphorylase (PYGM) Glycogen phosphorylase, muscle form PYGM | PYGM_RABIT
Type:
Enzyme
Mol. Mass.:
97296.32
Organism:
Oryctolagus cuniculus (rabbit)
Description:
Phosphorylation of Ser-15 converts phosphorylase B (unphosphorylated) to phosphorylase A.
Residue:
843
  
Inhibitor
Name:
BDBM34090
Synonyms:
benzamide derivative, 13r
Type:
Small organic molecule
Emp. Form.:
C16H11F2N3OS2
Mol. Mass.:
363.405
SMILES:
Nc1cc(F)c(Sc2nccs2)cc1C(=O)Nc1cccc(F)c1
:
Substrate
Name:
BDBM23188
Synonyms:
alpha-glucose-1-phosphate glucose-1-phosphate | {[(2R,3R,4S,5S,6R)-3,4,5-trihydroxy-6-(hydroxymethyl)oxan-2-yl]oxy}phosphonic acid
Type:
Emp. Form.:
C6H13O9P
Mol. Mass.:
260.1358
SMILES:
OC[C@H]1O[C@H](OP(O)(O)=O)[C@H](O)[C@@H](O)[C@@H]1O
: