Target
Beta-secretase 1
Ligand
BDBM400607
Substrate
Meas. Tech.
FRET Assay
IC50
0.450±0.0911 nM
Citation
 May, PCMergott, DJ Combination Alzheimer therapy using anti-N3pGlu Abeta antibodies + a BACE inhibitor US Patent  US9999624 Publication Date 6/19/2018 
Target
Name:
Beta-secretase 1
Synonyms:
ASP2 Aspartyl protease 2 BACE1 Beta-secretase (BACE) Beta-secretase 1 (BACE 1) Beta-secretase 1 (BACE1) Beta-site amyloid precursor protein cleaving enzyme 1 Memapsin-2 beta-Secretase (BACE-1) | beta-Secretase (BACE1)
Type:
Protein
Mol. Mass.:
55755.10
Organism:
Homo sapiens (Human)
Description:
P56817
Residue:
501
  
Inhibitor
Name:
BDBM400607
Synonyms:
US9999624, 6
Type:
Small organic molecule
Emp. Form.:
C23H19FN8OS
Mol. Mass.:
474.513
SMILES:
NC1=N[C@]2(CN(C[C@H]2CS1)c1ncc(F)cn1)c1cccc(NC(=O)c2ccc(cn2)C#N)c1
: