Target
Carbonic anhydrase
Ligand
BDBM10887
Substrate
BDBM10856
Meas. Tech.
CA Inhibition Assay
pH
8.3±n/a
Temperature
293.15±n/a K
Ki
1108±n/a nM
Citation
 Innocenti, AHall, RASchlicker, CScozzafava, ASteegborn, CMühlschlegel, FASupuran, CT Carbonic anhydrase inhibitors. Inhibition and homology modeling studies of the fungal beta-carbonic anhydrase from Candida albicans with sulfonamides. Bioorg Med Chem 17:4503-9 (2009)  
Target
Name:
Carbonic anhydrase
Synonyms:
CAN_CANAL beta-Carbonic Anhydrase
Type:
Enzyme
Mol. Mass.:
31587.59
Organism:
Candida albicans (Yeast)
Description:
Residue:
281
  
Inhibitor
Name:
BDBM10887
Synonyms:
Sulfamate 7 US11535599, Example topiramate | [(1R,2S,6S,9R)-4,4,11,11-tetramethyl-3,5,7,10,12-pentaoxatricyclo[7.3.0.0^{2,6}]dodecan-6-yl]methyl sulfamate
Type:
Small organic molecule
Emp. Form.:
C12H21NO8S
Mol. Mass.:
339.362
SMILES:
CC1(C)O[C@@H]2CO[C@@]3(COS(N)(=O)=O)OC(C)(C)O[C@H]3[C@@H]2O1
:
Substrate
Name:
BDBM10856
Synonyms:
Carbon Dioxide | methanedione
Type:
Small organic molecule
Emp. Form.:
CO2
Mol. Mass.:
44.0095
SMILES:
O=C=O
: