Target
Carbonic anhydrase
Ligand
BDBM10863
Substrate
BDBM10856
Meas. Tech.
CA Inhibition Assay
Ki
605±n/a nM
Citation
 Innocenti, AHall, RASchlicker, CScozzafava, ASteegborn, CMühlschlegel, FASupuran, CT Carbonic anhydrase inhibitors. Inhibition and homology modeling studies of the fungal beta-carbonic anhydrase from Candida albicans with sulfonamides. Bioorg Med Chem 17:4503-9 (2009)  
Target
Name:
Carbonic anhydrase
Synonyms:
Carbonic Anhydrase 2 (Can2)
Type:
Enzyme
Mol. Mass.:
26594.37
Organism:
Cryptococcus neoformans var. grubii (Filobasidiella neoformans var. grubii)
Description:
Residue:
239
  
Inhibitor
Name:
BDBM10863
Synonyms:
4-Amino-3-chlorobenzenesulfonamide CHEMBL7092 halogenosulfanilamide deriv. 5c
Type:
Small organic molecule
Emp. Form.:
C6H7ClN2O2S
Mol. Mass.:
206.65
SMILES:
Nc1ccc(cc1Cl)S(N)(=O)=O
:
Substrate
Name:
BDBM10856
Synonyms:
Carbon Dioxide | methanedione
Type:
Small organic molecule
Emp. Form.:
CO2
Mol. Mass.:
44.0095
SMILES:
O=C=O
: