Target
Carbonic anhydrase
Ligand
BDBM10869
Substrate
BDBM10856
Meas. Tech.
CA Inhibition Assay
Ki
815±n/a nM
Citation
 Innocenti, AHall, RASchlicker, CScozzafava, ASteegborn, CMühlschlegel, FASupuran, CT Carbonic anhydrase inhibitors. Inhibition and homology modeling studies of the fungal beta-carbonic anhydrase from Candida albicans with sulfonamides. Bioorg Med Chem 17:4503-9 (2009)  
Target
Name:
Carbonic anhydrase
Synonyms:
Carbonic Anhydrase 2 (Can2)
Type:
Enzyme
Mol. Mass.:
26594.37
Organism:
Cryptococcus neoformans var. grubii (Filobasidiella neoformans var. grubii)
Description:
Residue:
239
  
Inhibitor
Name:
BDBM10869
Synonyms:
5-imino-4-methyl-4,5-dihydro-1,3,4-thiadiazole-2-sulfonamide aromatic/heteroaromatic sulfonamide 14
Type:
Small organic molecule
Emp. Form.:
C3H6N4O2S2
Mol. Mass.:
194.235
SMILES:
Cn1nc(sc1=N)S(N)(=O)=O
:
Substrate
Name:
BDBM10856
Synonyms:
Carbon Dioxide | methanedione
Type:
Small organic molecule
Emp. Form.:
CO2
Mol. Mass.:
44.0095
SMILES:
O=C=O
: