Target
Disintegrin and metalloproteinase domain-containing protein 17
Ligand
BDBM400689
Substrate
Meas. Tech.
Inhibition Assay
IC50
<100±n/a nM
Citation
 Kamei, NSumikawa, YKamimura, DTodo, SYamada, TTokuoka, S Pyridone derivative, pharmaceutical containing the same and methods of use thereof US Patent  US10000476 Publication Date 6/19/2018 
Target
Name:
Disintegrin and metalloproteinase domain-containing protein 17
Synonyms:
ADA17_HUMAN CSVP Disintegrin and metalloproteinase domain-containing protein 17 (ADAM17) TNF-alpha convertase TNF-alpha-converting enzyme (TACE) Tumor necrosis factor-α converting enzyme (TACE)
Type:
Enzyme
Mol. Mass.:
93007.89
Organism:
Homo sapiens (Human)
Description:
Residue:
824
  
Inhibitor
Name:
BDBM400689
Synonyms:
US10000476, Compound I-48
Type:
Small organic molecule
Emp. Form.:
C15H11F2N3O3
Mol. Mass.:
319.2629
SMILES:
Fc1ccc(cc1)C1(Cn2cccc(F)c2=O)NC(=O)NC1=O
: