Target
Disintegrin and metalloproteinase domain-containing protein 17
Ligand
BDBM400721
Substrate
Meas. Tech.
Inhibition Assay
IC50
<100±n/a nM
Citation
 Kamei, NSumikawa, YKamimura, DTodo, SYamada, TTokuoka, S Pyridone derivative, pharmaceutical containing the same and methods of use thereof US Patent  US10000476 Publication Date 6/19/2018 
Target
Name:
Disintegrin and metalloproteinase domain-containing protein 17
Synonyms:
ADA17_HUMAN CSVP Disintegrin and metalloproteinase domain-containing protein 17 (ADAM17) TNF-alpha convertase TNF-alpha-converting enzyme (TACE) Tumor necrosis factor-α converting enzyme (TACE)
Type:
Enzyme
Mol. Mass.:
93007.89
Organism:
Homo sapiens (Human)
Description:
Residue:
824
  
Inhibitor
Name:
BDBM400721
Synonyms:
US10000476, Compound I-80
Type:
Small organic molecule
Emp. Form.:
C23H21N3O4
Mol. Mass.:
403.4305
SMILES:
Cc1cccc(Oc2ccc(cc2)C2(Cn3cccc(C)c3=O)NC(=O)NC2=O)c1
: