Target
Sarcoplasmic/endoplasmic reticulum calcium ATPase 1
Ligand
BDBM34129
Substrate
BDBM2
Meas. Tech.
Determination of Inhibitory Potencies by Coupled ATPase Activity Assay
pH
7.3±n/a
Temperature
310.15±n/a K
IC50
35300±16500 nM
Citation
 Deye, JElam, CLape, MRatliff, REvans, KPaula, S Structure-based virtual screening for novel inhibitors of the sarco/endoplasmic reticulum calcium ATPase and their experimental evaluation. Bioorg Med Chem 17:1353-60 (2009)  
Target
Name:
Sarcoplasmic/endoplasmic reticulum calcium ATPase 1
Synonyms:
AT2A1_RABIT Sarco/endoplasmic Reticulum Ca2+ ATPase 1 | Sarcoplasmic/endoplasmic reticulum calcium ATP-ase
Type:
PROTEIN
Mol. Mass.:
110435.34
Organism:
Oryctolagus cuniculus
Description:
ChEMBL_1500621
Residue:
1001
  
Inhibitor
Name:
BDBM34129
Synonyms:
2,4-di-tert-butyl-6-[1-(4-methoxyphenyl)ethyl]phenol, 4b
Type:
Small organic molecule
Emp. Form.:
C23H32O2
Mol. Mass.:
340.499
SMILES:
COc1ccc(cc1)C(C)c1cc(cc(c1O)C(C)(C)C)C(C)(C)C
:
Substrate
Name:
BDBM2
Synonyms:
({[({[(2R,3S,4R,5R)-5-(6-amino-9H-purin-9-yl)-3,4-dihydroxyoxolan-2-yl]methoxy}(hydroxy)phosphoryl)oxy](hydroxy)phosphoryl}oxy)phosphonic acid Brimonidine ATP | CHEMBL14249
Type:
Nucleoside or nucleotide
Emp. Form.:
C10H16N5O13P3
Mol. Mass.:
507.181
SMILES:
Nc1ncnc2n(cnc12)[C@@H]1O[C@H](COP(O)(=O)OP(O)(=O)OP(O)(O)=O)[C@@H](O)[C@H]1O
: