Target
Dimer of Gag-Pol polyprotein [489-587,Q496K,I573V]
Ligand
BDBM520
Substrate
fluorogenic peptide substrate, SQNY/PIVQ
Meas. Tech.
Protease Inhibition Assay
pH
5±n/a
Temperature
298.15±n/a K
Ki
0.91±0.33 nM
Km
24650±1930 nM
kcat
1.31±0.04 1/sec
Citation
 Muzammil, SMuzammil, SRoss, PRoss, PFreire, EFreire, E A major role for a set of non-active site mutations in the development of HIV-1 protease drug resistance. Biochemistry 42:631-8 (2003)  
Target
Name:
Dimer of Gag-Pol polyprotein [489-587,Q496K,I573V]
Synonyms:
HIV-1 Protease Mutant, A-1
Type:
Protein Complex
Mol. Mass.:
Description:
Components:
This complex has 2 components.
Component 1
Name:
Gag-Pol polyprotein [489-587,Q496K,I573V]
Synonyms:
HIV-1 Protease Mutant(Q7K/I84V) HIV-1 Protease Mutant, A-1 chain B gag-pol
Type:
Enzyme Subunit
Mol. Mass.:
10768.18
Organism:
Human immunodeficiency virus type 1
Description:
All of the protease constructs in this study are on the wild type containing the single Q7K mutation to prevent autocatalysis.This protein has enzymatic properties similar to that of the wild type protease.
Residue:
99
  
Component 2
Name:
Gag-Pol polyprotein [489-587,Q496K,I573V]
Synonyms:
HIV-1 Protease Mutant(Q7K/I84V) HIV-1 Protease Mutant, A-1 chain B gag-pol
Type:
Enzyme Subunit
Mol. Mass.:
10768.18
Organism:
Human immunodeficiency virus type 1
Description:
All of the protease constructs in this study are on the wild type containing the single Q7K mutation to prevent autocatalysis.This protein has enzymatic properties similar to that of the wild type protease.
Residue:
99
  
Inhibitor
Name:
BDBM520
Synonyms:
1,3-thiazol-5-ylmethyl N-[(2S,3S,5S)-3-hydroxy-5-[(2S)-3-methyl-2-{[methyl({[2-(propan-2-yl)-1,3-thiazol-4-yl]methyl})carbamoyl]amino}butanamido]-1,6-diphenylhexan-2-yl]carbamate CHEMBL163 RTV | Ritonavir
Type:
Small organic molecule
Emp. Form.:
C37H48N6O5S2
Mol. Mass.:
720.944
SMILES:
CC(C)[C@H](NC(=O)N(C)Cc1csc(n1)C(C)C)C(=O)N[C@H](C[C@H](O)[C@H](Cc1ccccc1)NC(=O)OCc1cncs1)Cc1ccccc1
:
Substrate
Name:
fluorogenic peptide substrate, SQNY/PIVQ
Synonyms:
Type:
Peptide
Mol. Mass.:
4728.18
Organism:
Description:
Residue:
44