Target
Bcl-2-related protein A1
Ligand
BDBM34169
Substrate
FITC-Ahx-EDIIRNIARHLAQVGDSMDR
Meas. Tech.
HTS discovery of chemical inhibitors of anti-apoptotic protein Bfl-1
pH
7±n/a
Temperature
296.15±n/a K
IC50
>100000±0 nM
Citation
 PubChem, PC HTS discovery of chemical inhibitors of anti-apoptotic protein Bfl-1 PubChem Bioassay (2008)[AID] 
Target
Name:
Bcl-2-related protein A1
Synonyms:
A1 B-cell leukemia/lymphoma 2 related protein A1a Bcl2a1 Bfl-1 Hemopoietic-specific early response protein | Protein BFL-1
Type:
Apoptosis regulator protein
Mol. Mass.:
19909.74
Organism:
Mus musculus (Mouse)
Description:
gi_11024684
Residue:
172
  
Inhibitor
Name:
BDBM34169
Synonyms:
(8S)-6-amino-8-(3-chlorophenyl)-2-methyl-1,3,8,8a-tetrahydroisoquinoline-5,7,7-tricarbonitrile MLS000028049 cid_657744
Type:
Small organic molecule
Emp. Form.:
C19H16ClN5
Mol. Mass.:
349.817
SMILES:
CN1CCC2=C(C#N)C(=N)C(C#N)(C#N)[C@@H](C2C1)c1cccc(Cl)c1
:
Substrate
Name:
FITC-Ahx-EDIIRNIARHLAQVGDSMDR
Synonyms:
FITC-Bid peptide
Type:
fluorescein-labeled peptide
Mol. Mass.:
358.43
Organism:
Description:
Residue:
3
NA