Target
Serine/threonine-protein kinase pim-1
Ligand
BDBM35049
Substrate
Biotinylated Substrate Peptide
Meas. Tech.
Pim Kinase Assay
Temperature
298.15±n/a K
Ki
4±n/a nM
Comments
extracted
Citation
 Tao, ZFHasvold, LALeverson, JDHan, EKGuan, RJohnson, EFStoll, VSStewart, KDStamper, GSoni, NBouska, JJLuo, YSowin, TJLin, NHGiranda, VSRosenberg, SHPenning, TD Discovery of 3H-benzo[4,5]thieno[3,2-d]pyrimidin-4-ones as potent, highly selective, and orally bioavailable inhibitors of the human protooncogene proviral insertion site in moloney murine leukemia virus (PIM) kinases. J Med Chem 52:6621-36 (2009)  
Target
Name:
Serine/threonine-protein kinase pim-1
Synonyms:
PIM-1 Kinase PIM1_HUMAN Serine/threonine-protein kinase (PIM1) Serine/threonine-protein kinase PIM1 | Serine/threonine-protein kinase pim-1 (PIM1)
Type:
Protein
Mol. Mass.:
35681.82
Organism:
Homo sapiens (Human)
Description:
P11309
Residue:
313
  
Inhibitor
Name:
BDBM35049
Synonyms:
benzothienopyrimidinone deriv., 20d
Type:
Small organic molecule
Emp. Form.:
C22H18N4O2S
Mol. Mass.:
402.469
SMILES:
O[C@H]1CCN(Cc2nc3c4cc(ccc4sc3c(=O)[nH]2)-c2ccc(cc2)C#N)C1
:
Substrate
Name:
Ryanodine receptor 1 [4317-4329]
Synonyms:
Biotinylated Substrate Peptide RYR1 | RYR1_HUMAN
Type:
Peptide
Mol. Mass.:
2871.44
Organism:
Description:
P21817[4317-4329]
Residue:
24