Target
Cytoplasmic tyrosine-protein kinase BMX
Ligand
BDBM400799
Substrate
Meas. Tech.
In vitro Kinase Assay
IC50
15.9±n/a nM
Citation
 Gray, NBalk, SLiu, QChen, S Bone marrow on X chromosome kinase (BMX) inhibitors and uses thereof US Patent  US10000483 Publication Date 6/19/2018 
Target
Name:
Cytoplasmic tyrosine-protein kinase BMX
Synonyms:
BMX BMX_HUMAN Cytoplasmic tyrosine-protein kinase BMX (BMX) Epithelial and endothelial tyrosine kinase Tyrosine Kinase BMX | Tyrosine-protein kinase BMX/ETK
Type:
Tyrosine-protein kinase
Mol. Mass.:
78030.42
Organism:
Homo sapiens (Human)
Description:
P51813
Residue:
675
  
Inhibitor
Name:
BDBM400799
Synonyms:
QL-XI-77 | US10000483, Compound I-7
Type:
Small organic molecule
Emp. Form.:
C28H21N3O2
Mol. Mass.:
431.4852
SMILES:
Cc1ccc(cc1NC(=O)C=C)-n1c2c(ccc1=O)cnc1ccc(cc21)-c1ccccc1
: