Target
Cytoplasmic tyrosine-protein kinase BMX
Ligand
BDBM400819
Substrate
Meas. Tech.
In vitro Kinase Assay
IC50
5.62±n/a nM
Citation
 Gray, NBalk, SLiu, QChen, S Bone marrow on X chromosome kinase (BMX) inhibitors and uses thereof US Patent  US10000483 Publication Date 6/19/2018 
Target
Name:
Cytoplasmic tyrosine-protein kinase BMX
Synonyms:
BMX BMX_HUMAN Cytoplasmic tyrosine-protein kinase BMX (BMX) Epithelial and endothelial tyrosine kinase Tyrosine Kinase BMX | Tyrosine-protein kinase BMX/ETK
Type:
Tyrosine-protein kinase
Mol. Mass.:
78030.42
Organism:
Homo sapiens (Human)
Description:
P51813
Residue:
675
  
Inhibitor
Name:
BDBM400819
Synonyms:
QL-XII-44 | US10000483, Compound II-12
Type:
Small organic molecule
Emp. Form.:
C32H22N4O2
Mol. Mass.:
494.5427
SMILES:
C=CC(=O)N1CCc2ccc(cc12)-n1c2c(ccc1=O)cnc1ccc(cc21)-c1cnc2ccccc2c1
: