Target
Nuclear receptor subfamily 2 group C member 2
Ligand
BDBM50245587
Substrate
Meas. Tech.
Binding Assay
IC50
>3300±n/a nM
Citation
 Gray, NBalk, SLiu, QChen, S Bone marrow on X chromosome kinase (BMX) inhibitors and uses thereof US Patent  US10000483 Publication Date 6/19/2018 
Target
Name:
Nuclear receptor subfamily 2 group C member 2
Synonyms:
NR2C2 Nuclear receptor subfamily 2 group C member 2 TAK1 | TR4
Type:
PROTEIN
Mol. Mass.:
65411.75
Organism:
Homo sapiens (Human)
Description:
ChEMBL_1476357
Residue:
596
  
Inhibitor
Name:
BDBM50245587
Synonyms:
CHEMBL4077064 | US10000483, Compound II-4
Type:
Small organic molecule
Emp. Form.:
C27H21N5O2
Mol. Mass.:
447.4879
SMILES:
Cn1cc(cn1)-c1ccc2ncc3ccc(=O)n(-c4ccc5CCN(C(=O)C=C)c5c4)c3c2c1
: