Target
MAP kinase-interacting serine/threonine-protein kinase 1
Ligand
BDBM400827
Substrate
Meas. Tech.
Biochemical Enzymatic Assay
IC50
>5050±n/a nM
Citation
 Sprengeler, PAReich, SHWebber, SEErnst, JT Heterocyclic compounds that inhibit the kinase activity of Mnk useful for treating various cancers US Patent  US10000487 Publication Date 6/19/2018 
Target
Name:
MAP kinase-interacting serine/threonine-protein kinase 1
Synonyms:
MAP Kinase-Interacting Protein Kinase (MNK1) MAP kinase-interacting serine/threonine-protein kinase 1 (MnK1) MAP-kinase interacting kinase 1 (MNK1) MKNK1 MNK1
Type:
Serine/threonine-protein kinase
Mol. Mass.:
51342.85
Organism:
Homo sapiens (Human)
Description:
Q9BUB5
Residue:
465
  
Inhibitor
Name:
BDBM400827
Synonyms:
US10000487, Example 4F
Type:
Small organic molecule
Emp. Form.:
C14H15ClN6O2
Mol. Mass.:
334.761
SMILES:
Clc1cc(Nc2ncn[nH]2)c(=O)n2c1C(=O)NC21CCCCC1
: