Target
Serine/threonine-protein kinase pim-1
Ligand
BDBM400865
Substrate
Meas. Tech.
Enzyme Assay
IC50
<10±n/a nM
Citation
 Li, YBurns, DMFeng, HHuang, TMei, SPan, JYe, HZhu, WRafalski, MWang, AXue, C Furo- and thieno-pyridine carboxamide compounds useful as pim kinase inhibitors US Patent  US10000507 Publication Date 6/19/2018 
Target
Name:
Serine/threonine-protein kinase pim-1
Synonyms:
PIM-1 Kinase PIM1_HUMAN Serine/threonine-protein kinase (PIM1) Serine/threonine-protein kinase PIM1 | Serine/threonine-protein kinase pim-1 (PIM1)
Type:
Protein
Mol. Mass.:
35681.82
Organism:
Homo sapiens (Human)
Description:
P11309
Residue:
313
  
Inhibitor
Name:
BDBM400865
Synonyms:
2-Amino-N-[5-(4-aminoazepan-1-yl)-1-methyl-1H-pyrazol-4-yl]-6-(1-methylazetidin-3-yl)thieno[3,2-b]pyridine-3-carboxamide | US10000507, Example 32
Type:
Small organic molecule
Emp. Form.:
C22H30N8OS
Mol. Mass.:
454.592
SMILES:
CN1CC(C1)c1cnc2c(C(=O)Nc3cnn(C)c3N3CCCC(N)CC3)c(N)sc2c1
: