Target
Serine/threonine-protein kinase pim-3
Ligand
BDBM400867
Substrate
Meas. Tech.
Enzyme Assay
IC50
<10±n/a nM
Citation
 Li, YBurns, DMFeng, HHuang, TMei, SPan, JYe, HZhu, WRafalski, MWang, AXue, C Furo- and thieno-pyridine carboxamide compounds useful as pim kinase inhibitors US Patent  US10000507 Publication Date 6/19/2018 
Target
Name:
Serine/threonine-protein kinase pim-3
Synonyms:
PIM3 Serine/threonine-protein kinase pim-3 (PIM3)
Type:
Protein
Mol. Mass.:
35888.19
Organism:
Homo sapiens (Human)
Description:
Q86V86
Residue:
326
  
Inhibitor
Name:
BDBM400867
Synonyms:
2-Amino-N-{4-[(3S)-3-aminopiperidin-1-yl]pyridin-3-yl}-6-(methoxymethyl)thieno[3,2-b]pyridine-3-carboxamide | US10000507, Example 34
Type:
Small organic molecule
Emp. Form.:
C20H24N6O2S
Mol. Mass.:
412.509
SMILES:
COCc1cnc2c(C(=O)Nc3cnccc3N3CCC[C@H](N)C3)c(N)sc2c1
: