Target
Beta-secretase 1
Ligand
BDBM234464
Substrate
Meas. Tech.
Binding Assay
Ki
11.0±n/a nM
Citation
 Juhl, KMarigo, MTagmose, LJensen, T Combination treatment comprising administration of 2-amino-3,5,5-trifluoro-3,4,5,6-tetrahydropyridines US Patent  US10004738 Publication Date 6/26/2018 
Target
Name:
Beta-secretase 1
Synonyms:
ASP2 Aspartyl protease 2 BACE1 Beta-secretase (BACE) Beta-secretase 1 (BACE 1) Beta-secretase 1 (BACE1) Beta-site amyloid precursor protein cleaving enzyme 1 Memapsin-2 beta-Secretase (BACE-1) | beta-Secretase (BACE1)
Type:
Protein
Mol. Mass.:
55755.10
Organism:
Homo sapiens (Human)
Description:
P56817
Residue:
501
  
Inhibitor
Name:
BDBM234464
Synonyms:
US10004738, 48 | US9353084, 17
Type:
Small organic molecule
Emp. Form.:
C20H20F4N4O2
Mol. Mass.:
424.392
SMILES:
COc1ccc(nc1)C(=O)Nc1ccc(F)c(c1)[C@@]1(C)N=C(N)[C@@](C)(F)CC1(F)F
: