Target
E3 ubiquitin-protein ligase Mdm2
Ligand
BDBM35067
Substrate
p53 Peptide
Meas. Tech.
Fluorescence Anisotropy Competition Binding Assay
pH
7.6±n/a
Temperature
296.15±n/a K
IC50
13000±1000 nM
Citation
 Hayashi, RWang, DHara, TIera, JADurell, SRAppella, DH N-acylpolyamine inhibitors of HDM2 and HDMX binding to p53. Bioorg Med Chem 17:7884-93 (2009)  
Target
Name:
E3 ubiquitin-protein ligase Mdm2
Synonyms:
Double minute 2 protein E3 ubiquitin-protein ligase Mdm2 (p53-binding protein Mdm2) Human Double Minute 2 (HDM2) MDM2-MDMX p53-Binding Protein MDM2 | p53-binding protein
Type:
Oncoprotein
Mol. Mass.:
55196.54
Organism:
Homo sapiens (Human)
Description:
Q00987
Residue:
491
  
Inhibitor
Name:
BDBM35067
Synonyms:
N-acylpolyamine (NAPA) scaffold, 14
Type:
Small organic molecule
Emp. Form.:
C49H70Br2N10O9
Mol. Mass.:
1102.95
SMILES:
NCCCCC(CN(C(CCC(O)=O)CN(CCC(N)=O)C(=O)NCCCc1ccc(Br)cc1)C(=O)NCCc1ccc(Br)cc1)N(CC(CCC(O)=O)NC(N)=O)C(=O)NCCCc1ccccc1
:
Substrate
Name:
Cellular tumor antigen p53 (aa 15-29)
Synonyms:
P53 TP53 | p53 (aa 15-29)
Type:
fluorescein-conjugated peptide
Mol. Mass.:
1804.95
Organism:
Tupaia belangeri (Common tree shrew) (Tupaia glis belangeri)
Description:
Q9TTA1 aa 15-29
Residue:
15
SQETFSDLWKLLPEN