Target
Tyrosine-protein kinase receptor UFO
Ligand
BDBM350843
Substrate
Meas. Tech.
Inhibition Assay
IC50
23.0±n/a nM
Citation
 Wang, XZhang, WFrye, S Therapeutic uses of selected pyrrolopyrimidine compounds with anti-mer tyrosine kinase activity US Patent  US10004755 Publication Date 6/26/2018 
Target
Name:
Tyrosine-protein kinase receptor UFO
Synonyms:
AXL TEL/AXL UFO | UFO_HUMAN
Type:
Enzyme
Mol. Mass.:
98316.97
Organism:
Homo sapiens (Human)
Description:
P30530
Residue:
894
  
Inhibitor
Name:
BDBM350843
Synonyms:
UNC1971A US9795606, B2
Type:
Small organic molecule
Emp. Form.:
C26H35FN6O3S
Mol. Mass.:
530.658
SMILES:
CCCCNc1ncc2c(cn(C3CC[C@H](N)CC3)c2n1)-c1ccc(c(F)c1)S(=O)(=O)N1CCOCC1
: