Target
Tyrosine-protein kinase receptor TYRO3
Ligand
BDBM350854
Substrate
Meas. Tech.
Inhibition Assay
IC50
49.0±n/a nM
Citation
 Wang, XZhang, WFrye, S Therapeutic uses of selected pyrrolopyrimidine compounds with anti-mer tyrosine kinase activity US Patent  US10004755 Publication Date 6/26/2018 
Target
Name:
Tyrosine-protein kinase receptor TYRO3
Synonyms:
BYK RSE TIF TYRO3_HUMAN | Tyrosine-protein kinase SKY
Type:
Protein
Mol. Mass.:
96894.13
Organism:
Homo sapiens (Human)
Description:
Q06418
Residue:
890
  
Inhibitor
Name:
BDBM350854
Synonyms:
UNC2142A US9795606, B13
Type:
Small organic molecule
Emp. Form.:
C27H37N5O2
Mol. Mass.:
463.615
SMILES:
CCCCNc1ncc2c(cn(C3CC[C@H](O)CC3)c2n1)-c1ccc(CN2CCOCC2)cc1
: