Target
Tyrosine-protein kinase receptor UFO
Ligand
BDBM350857
Substrate
Meas. Tech.
Inhibition Assay
IC50
245±n/a nM
Citation
 Wang, XZhang, WFrye, S Therapeutic uses of selected pyrrolopyrimidine compounds with anti-mer tyrosine kinase activity US Patent  US10004755 Publication Date 6/26/2018 
Target
Name:
Tyrosine-protein kinase receptor UFO
Synonyms:
AXL TEL/AXL UFO | UFO_HUMAN
Type:
Enzyme
Mol. Mass.:
98316.97
Organism:
Homo sapiens (Human)
Description:
P30530
Residue:
894
  
Inhibitor
Name:
BDBM350857
Synonyms:
UNC2253A US9795606, B16
Type:
Small organic molecule
Emp. Form.:
C29H39N5O2
Mol. Mass.:
489.6523
SMILES:
CCCCNc1ncc2c(cn(C3CC[C@H](O)CC3)c2n1)-c1ccc(cc1)C1(CC1)N1CCOCC1
: