Target
Receptor-type tyrosine-protein kinase FLT3
Ligand
BDBM350859
Substrate
Meas. Tech.
Inhibition Assay
IC50
3.20±n/a nM
Citation
 Wang, XZhang, WFrye, S Therapeutic uses of selected pyrrolopyrimidine compounds with anti-mer tyrosine kinase activity US Patent  US10004755 Publication Date 6/26/2018 
Target
Name:
Receptor-type tyrosine-protein kinase FLT3
Synonyms:
CD135 FL cytokine receptor FLK2 FLT3 Fetal liver kinase-2 Fms-like tyrosine kinase 3 (Flt-3) STK-1 Stem cell tyrosine kinase 1
Type:
Enzyme
Mol. Mass.:
112888.62
Organism:
Homo sapiens (Human)
Description:
P36888
Residue:
993
  
Inhibitor
Name:
BDBM350859
Synonyms:
UNC2368A US9795606, B18
Type:
Small organic molecule
Emp. Form.:
C27H34FN5O4S
Mol. Mass.:
543.653
SMILES:
O[C@H]1CCC(CC1)n1cc(-c2ccc(cc2F)S(=O)(=O)N2CCOCC2)c2cnc(NCCC3CC3)nc12
: