Target
Tyrosine-protein kinase receptor UFO
Ligand
BDBM401010
Substrate
Meas. Tech.
Inhibition Assay
IC50
60.0±n/a nM
Citation
 Wang, XZhang, WFrye, S Therapeutic uses of selected pyrrolopyrimidine compounds with anti-mer tyrosine kinase activity US Patent  US10004755 Publication Date 6/26/2018 
Target
Name:
Tyrosine-protein kinase receptor UFO
Synonyms:
AXL TEL/AXL UFO | UFO_HUMAN
Type:
Enzyme
Mol. Mass.:
98316.97
Organism:
Homo sapiens (Human)
Description:
P30530
Residue:
894
  
Inhibitor
Name:
BDBM401010
Synonyms:
US10004755, Compound UNC4308A
Type:
Small organic molecule
Emp. Form.:
C27H38N6O
Mol. Mass.:
462.6302
SMILES:
CCCCNc1ncc2c(cn(C3CC[C@H](O)CC3)c2n1)-c1ccc(NC2CCNCC2)cc1
: