Target
AMSH-like protease
Ligand
BDBM400994
Substrate
Meas. Tech.
Biochemical Assay
IC50
900±n/a nM
Citation
 Deshaies, RJLi, JCohen, SPerez, CMa, Y Inhibitors of RPN11 US Patent  US10005735 Publication Date 6/26/2018 
Target
Name:
AMSH-like protease
Synonyms:
AMSH-LP KIAA1373 STAM-binding protein-like 1 (AMSH) | STAMBPL1
Type:
Protein
Mol. Mass.:
49789.14
Organism:
Homo sapiens (Human)
Description:
Q96FJ0
Residue:
436
  
Inhibitor
Name:
BDBM400994
Synonyms:
US10005735, Compound 7
Type:
Small organic molecule
Emp. Form.:
C15H12N2O2S
Mol. Mass.:
284.333
SMILES:
Sc1cccc2cc(cnc12)C(=O)NCc1ccco1
: