Target
COP9 signalosome complex subunit 5
Ligand
BDBM401023
Substrate
Meas. Tech.
Biochemical Assay
IC50
350±n/a nM
Citation
 Deshaies, RJLi, JCohen, SPerez, CMa, Y Inhibitors of RPN11 US Patent  US10005735 Publication Date 6/26/2018 
Target
Name:
COP9 signalosome complex subunit 5
Synonyms:
COP9 signalosome complex subunit 5 (Csn5) CSN5 JAB1
Type:
Protein
Mol. Mass.:
37578.39
Organism:
Homo sapiens (Human)
Description:
Q92905
Residue:
334
  
Inhibitor
Name:
BDBM401023
Synonyms:
US10005735, Compound 21
Type:
Small organic molecule
Emp. Form.:
C21H21N3O2S
Mol. Mass.:
379.475
SMILES:
Sc1cccc2cc(cnc12)C(=O)NCc1ccc(cc1)N1CCOCC1
: