Target
COP9 signalosome complex subunit 5
Ligand
BDBM401029
Substrate
Meas. Tech.
Biochemical Assay
IC50
4400±n/a nM
Citation
 Deshaies, RJLi, JCohen, SPerez, CMa, Y Inhibitors of RPN11 US Patent  US10005735 Publication Date 6/26/2018 
Target
Name:
COP9 signalosome complex subunit 5
Synonyms:
COP9 signalosome complex subunit 5 (Csn5) CSN5 JAB1
Type:
Protein
Mol. Mass.:
37578.39
Organism:
Homo sapiens (Human)
Description:
Q92905
Residue:
334
  
Inhibitor
Name:
BDBM401029
Synonyms:
US10005735, Compound 27
Type:
Small organic molecule
Emp. Form.:
C17H17N3OS2
Mol. Mass.:
343.466
SMILES:
Cc1nc(CCNC(=O)c2cnc3c(S)cccc3c2)sc1C
: